Часто задаваемые вопросы

Оцените сайт

1 посетитель на сайте. Из них:
Гости1
Список пользователей
Noik99 Был(a) в сети 25 минут назад
posfap Был(a) в сети 32 минуты назад
Dutch78 Был(a) в сети 38 минут назад
Evgen Был(a) в сети 1 час назад
Moon_420 Был(a) в сети 1 час назад
sts2873 Был(a) в сети 1 час назад
oleg.oleg_md Был(a) в сети 2 часа назад
FedorShatokhin Был(a) в сети 2 часа назад
SherHAN Был(a) в сети 2 часа назад
WWW Был(a) в сети 3 часа назад
iegudil Был(a) в сети 3 часа назад
limosha Был(a) в сети 4 часа назад
ogonb1976 Был(a) в сети 4 часа назад
FOG75 Был(a) в сети 7 часов назад
richardneeberg Был(a) в сети 7 часов назад
arturqqqa Был(a) в сети 12 часов назад
nitojv Был(a) в сети 13 часов назад
Olegator7828 Был(a) в сети 18 часов назад

FAILED: TARGET_KERNEL_BINARIES (error: openssl/opensslv.h: No such file or directory)


[  0% 270/67545] Building Kernel
FAILED: TARGET_KERNEL_BINARIES 
/bin/bash -c "(rm -rf /home/pixelexp9/pe/out/target/product/vince/vendor/lib/modules ) && (mkdir -p /home/pixelexp9/pe/out/target/product/vince/vendor/lib/modules ) && (rm -rf /home/pixelexp9/pe/out/target/product/vince/obj/PACKAGING/depmod_vendor_intermediates ) && (make -j2  CFLAGS_MODULE=\"-fno-pic\" -C kernel/xiaomi/vince O=/home/pixelexp9/pe/out/target/product/vince/obj/KERNEL_OBJ ARCH=arm64 CROSS_COMPILE=\"/usr/bin/ccache aarch64-linux-androidkernel-\" CROSS_COMPILE_ARM32=\"arm-linux-androidkernel-\"   Image.gz-dtb ) && (if grep -q '^CONFIG_OF=y' /home/pixelexp9/pe/out/target/product/vince/obj/KERNEL_OBJ/.config; then                     echo \"Building DTBs\";                          make -j2  CFLAGS_MODULE=\"-fno-pic\" -C kernel/xiaomi/vince O=/home/pixelexp9/pe/out/target/product/vince/obj/KERNEL_OBJ ARCH=arm64 CROSS_COMPILE=\"/usr/bin/ccache aarch64-linux-androidkernel-\" CROSS_COMPILE_ARM32=\"arm-linux-androidkernel-\"   dtbs;          fi ) && (if grep -q '^CONFIG_MODULES=y' /home/pixelexp9/pe/out/target/product/vince/obj/KERNEL_OBJ/.config; then                      echo \"Building Kernel Modules\";                        make -j2  CFLAGS_MODULE=\"-fno-pic\" -C kernel/xiaomi/vince O=/home/pixelexp9/pe/out/target/product/vince/obj/KERNEL_OBJ ARCH=arm64 CROSS_COMPILE=\"/usr/bin/ccache aarch64-linux-androidkernel-\" CROSS_COMPILE_ARM32=\"arm-linux-androidkernel-\"   modules;               fi )"
make: Entering directory '/home/pixelexp9/pe/kernel/xiaomi/vince'
make[1]: Entering directory '/home/pixelexp9/pe/out/target/product/vince/obj/KERNEL_OBJ'
  GEN     ./Makefile
scripts/kconfig/conf  --silentoldconfig Kconfig
  CHK     include/config/kernel.release
  GEN     ./Makefile
  CHK     include/generated/uapi/linux/version.h
  CHK     include/generated/utsrelease.h
  Using /home/pixelexp9/pe/kernel/xiaomi/vince as source for kernel
  CHK     scripts/mod/devicetable-offsets.h
  HOSTCC  scripts/extract-cert
  HOSTCC  scripts/sign-file
/home/pixelexp9/pe/kernel/xiaomi/vince/scripts/extract-cert.c:21:10: fatal error: openssl/bio.h: No such file or directory
 #include <openssl/bio.h>
          ^~~~~~~~~~~~~~~
compilation terminated.
/home/pixelexp9/pe/kernel/xiaomi/vince/scripts/sign-file.c:25:10: fatal error: openssl/opensslv.h: No such file or directory
 #include <openssl/opensslv.h>
          ^~~~~~~~~~~~~~~~~~~~
compilation terminated.
scripts/Makefile.host:101: recipe for target 'scripts/sign-file' failed
make[2]: *** [scripts/sign-file] Error 1
make[2]: *** Waiting for unfinished jobs....
scripts/Makefile.host:101: recipe for target 'scripts/extract-cert' failed
make[2]: *** [scripts/extract-cert] Error 1
/home/pixelexp9/pe/kernel/xiaomi/vince/Makefile:574: recipe for target 'scripts' failed
make[1]: *** [scripts] Error 2
make[1]: Leaving directory '/home/pixelexp9/pe/out/target/product/vince/obj/KERNEL_OBJ'
Makefile:152: recipe for target 'sub-make' failed
make: *** [sub-make] Error 2
make: Leaving directory '/home/pixelexp9/pe/kernel/xiaomi/vince'
[  0% 275/67545] target thumb C++: libv8platform_32 <= external/v8/src/libplatform/default-platform.cc
ninja: build stopped: subcommand failed.
08:35:24 ninja failed with: exit status 1

#### failed to build some targets (01:42 (mm:ss)) ####

Устанавливаем:

sudo apt-get install libssl-dev





Гость, оставишь комментарий?
Имя:*
E-Mail: